{"text_format":"1","workbook":"xlsx","n_sheets":10,"sheets":["READ BEFORE STARTING!","Reference Sheet","Section 4.1","Section 4.2","Section 4.3","Section 7.2","Section 7.3","Section 8","Annex 4 Section 8.4","Support sheet (hidden)"],"not_rendered":{"charts":0,"images":0,"macros":1,"external_links":0,"defined_names":10,"comments":0,"pivot_tables":0},"unopened":[],"bounds":{"document_bytes":16777216,"sheet_cells":100000,"rows_first":2000,"rows_last":500,"rows_between":2000,"halvings":0,"cell_chars":16384,"cell_head_chars":4096},"cells_cut":0,"cells_raw":0,"read":"whole","date_system":"1900"}

{"sheet":"READ BEFORE STARTING!","index":0,"n_rows":6,"n_cols":2,"rows_kept":6,"cut":false,"hidden":false,"merged":[[1,1,3,8],[5,1,30,8]]}
[]
[null,"READ BEFORE STARTING!"]
[]
[]
[]
[null,"Please enable macros in order to use all interactive features in this workbook.\n\n1. When you first open the file\n- A security warning (“Enable Content” or “Macros have been disabled”) appears under the ribbon.\n- Click Enable Content (Windows) or Enable Macros (Mac) to allow the VBA code to run.\nNote: Once you turn on the macros and make file a trusted document, the next time you open the workbook, the security warning will not appear. \n\n2. If you declined the macros accidentally, you can either simply re-open the workbook and repeat Step 1 above, or follow the steps below\n\n- Windows Excel\n  > Go to File > Info\n  > Click Enable Content next to the Security Warning.\n  > If no warning is visible, go to File > Options > Trust Center > Trust Center Settings… > Macro Settings, choose “Enable all macros”, click OK, then close & reopen the workbook.\n\n- Mac Excel\n  > Go to Excel > Preferences… > Security & Privacy\n  > Under Macro Security, select “Enable all macros” or “Enable macros for this workbook”\n  > Close & reopen the workbook.\n\n3. Why?\n- All of the interactive show/hide logic, pop‑up reminders, and cell‑locking in this file is driven by VBA.\n- If macros remain disabled, those features will not work and some tables may remain hidden.\n\nTip: If you ever see unexpected blanks or missing tables, check that macros are enabled and then reopen the file.\t\t\t\t"]

{"sheet":"Reference Sheet","index":1,"n_rows":47,"n_cols":7,"rows_kept":47,"cut":false,"hidden":false,"merged":[[10,6,14,12],[5,16,6,17],[15,2,15,3],[5,6,7,12],[7,14,7,15],[24,3,24,4],[24,1,24,2],[23,3,23,4],[23,1,23,2],[0,0,2,0],[1,1,2,4],[5,3,5,4],[5,1,5,2],[10,1,10,2],[11,1,13,3]]}
[]
[null,"REFERENCE SHEET\nAlways Copy and Paste using Match Destination Formatting or Paste Values"]
[]
[]
[]
[null,"Reporting Period",null,"Monitoring Period",null,null,"Instructions\n\nEnter the Reporting and Monitoring Period Start and End Dates in the cells highlighted in red (B8 to E8). Once a date is entered, the cell will turn blue to indicate it remains editable.\n\n1. Reporting Period: Means each time period, as part of the Crediting Period for which the Program Entity has to measure and report on ERs generated under the ER Program in the form of ER Monitoring Reports. \n\n2. Monitoring Period: Means the time period, typically covering full calendar years, during which the REDD+ Country Participant estimates GHG emissions and removals used to quantify ERs for an ER-MR, and which may extend beyond the contractual Reporting Period to enable alignment with available monitoring data and systems.\n\nNote: In the first Reporting Period, the Monitoring Period may differ from the Reporting Period to allow alignment with available monitoring data. In subsequent Reporting Periods, the Monitoring Period must be identical to the Reporting Period."]
[null,"Start Date\n(YYYY-MM-DD)","End Date\n(YYYY-MM-DD)","Start Date\n(YYYY-MM-DD)","End Date\n(YYYY-MM-DD)"]
[]
[]
[]
[null,"Select the Applicable Option:",null,"Select Option",{"$f":"IF(D11=\"Select Option\", \"⚠️ Please select a valid Option\", \"\")","v":"⚠️ Please select a valid Option"},null,"Instructions  HFLD Selection\n\nUse thedropdown menu in D11 to indicate whether you wish to label the ERs as HFLD.\n\nOption 1: Yes – I want to apply the HFLD label to FCPF ERs. If yes, please provide:\n  > The max adjustment to average historical emissions (HFLD) in cell C16.\n  > The ERs sold, assigned or otherwise used by any other entity for sale, public relations, compliance or any other purpose including ERs accounted separately under other GHG accounting schemes or ERs that have been set-aside to meet Reversal management requirements under other GHG accounting schemes in C19 to G19, if applicable. \nPlease ensure this calculation also incorporates the ERs held in the applicable GHG Program Buffer Pool.\n\nOption 2: No – I do not want to apply the HFLD label.\nSelecting No will hide all HFLD-related calculation tables automatically alongside the workbook."]
[null,"Are you a REDD Country Participant wishing to label FCPF ERs as High Forest Low Deforestation (HFLD) resulting from the application of an adjustment to average historical emissions?\n- Option 1: Yes, I would like to label FCPF ERs as HFLD.\n- Option 2: No, I would not like to label FCPF ERs as HFLD. "]
[]
[]
[]
{"$rows_left_out":33}
{"sheet":"Section 4.1","index":2,"n_rows":28,"n_cols":9,"rows_kept":28,"cut":false,"hidden":false,"merged":[[17,4,18,6],[17,1,18,3],[4,1,5,3],[1,1,2,7],[4,4,5,6]]}
[]
[null,"Section 4.1 - ER Program Reference Level for the Monitoring Period covered in the ER-MR"]
[]
[]
[null," Input Data (With Decimals)\nAlways Copy and Paste using Match Destination Formatting or Paste Values",null,null,"1. Copy and paste the original values here with all decimals, as reported in the ER Program’s own calculation spreadsheet (i.e. the national spreadsheet developed by the ER Program).Fill out the cells highlighted in red.\nIf a value is not applicable, enter “0” instead of leaving the cell blank.\nOnce filled, red cells will turn blue to indicate that they remain editable (as opposed to white, which are locked).\n2. Do not manually truncate, please."]
[]
[]
[null," Year of Monitoring / Reporting Period t","Average annual historical Emissions from deforestation over the Reference Period (tCO2-e/yr)","If applicable, average annual historical Emissions from forest degradation over the Reference Period (tCO2-e/yr)","If applicable, average annual historical enhanced Removals from afforestation/reforestation (AR) (tCO2-e/yr)","If applicable, average annual historical enhanced Removals from other activities besides A/R (tCO2-e/yr)","Adjustment, if applicable (tCO2-e/yr)","Reference Level (tCO2-e/yr)"]
[null,{"$f":"IF('Reference Sheet'!$B$43:$B$47=0,\"\",'Reference Sheet'!$B$43:$B$47)","v":""},null,null,null,null,null,{"$f":"IF(COUNT($C9, $D9, $E9, $F9, $G9)=0, \"\", SUM($C9:$G9))","v":""}]
[null,"",null,null,null,null,null,{"$f":"IF(COUNT($C10, $D10, $E10, $F10, $G10)=0, \"\", SUM($C10:$G10))","v":""}]
[null,"",null,null,null,null,null,""]
[null,"",null,null,null,null,null,""]
[null,"",null,null,null,null,null,""]
[null,"Total",{"$f":"IF(COUNTA($C$9:$C$13)=0, \"\", SUM($C$9:$C$13))","v":""},{"$f":"IF(COUNTA($D$9:$D$13)=0, \"\", SUM($D$9:$D$13))","v":""},{"$f":"IF(COUNTA($E$9:$E$13)=0, \"\", SUM($E$9:$E$13))","v":""},{"$f":"IF(COUNTA($F$9:$F$13)=0, \"\", SUM($F$9:$F$13))","v":""},{"$f":"IF(COUNTA($G$9:$G$13)=0, \"\", SUM($G$9:$G$13))","v":""},""]
[null,null,{"$f":"SUMPRODUCT(($B$9:$B$13<>\"\")*(C9:C13=\"\"))","v":0},{"$f":"SUMPRODUCT(($B$9:$B$13<>\"\")*(D9:D13=\"\"))","v":0},{"$f":"SUMPRODUCT(($B$9:$B$13<>\"\")*(E9:E13=\"\"))","v":0},{"$f":"SUMPRODUCT(($B$9:$B$13<>\"\")*(F9:F13=\"\"))","v":0},{"$f":"SUMPRODUCT(($B$9:$B$13<>\"\")*(G9:G13=\"\"))","v":0},{"$f":"SUMPRODUCT(($B$9:$B$13<>\"\")*(H9:H13=\"\"))","v":0}]
{"$rows_left_out":14}
{"sheet":"Section 4.2","index":3,"n_rows":30,"n_cols":7,"rows_kept":30,"cut":false,"hidden":false,"merged":[[21,6,22,6],[7,2,8,2],[7,3,8,3],[7,6,8,6],[7,1,8,1],[7,4,8,4],[21,1,22,1],[21,4,22,4],[7,5,8,5],[21,5,22,5],[21,2,22,2],[21,3,22,3],[1,1,2,6],[4,1,5,3],[18,1,19,3],[4,4,5,5],[18,4,19,5]]}
[]
[null,"Section 4.2 - Estimation of Emissions by Sources and Removals by Sinks included in the ER Program’s scope"]
[]
[]
[null," Input Data (With Decimals)\nAlways Copy and Paste using Match Destination Formatting or Paste Values ",null,null,"1. Copy and paste the original values here with all decimals, as reported in the ER Program’s own calculation spreadsheet (i.e. the national spreadsheet developed by the ER Program).Fill out the cells highlighted in red.\nIf a value is not applicable, enter “0” instead of leaving the cell blank.\nOnce filled, red cells will turn blue to indicate that they remain editable (as opposed to white, which are locked).\n2. Do not manually truncate, please."]
[]
[]
[null,"Year of Monitoring / Report Period t","Emissions from deforestation (tCO2-e/yr)","If applicable, Emissions from forest degradation (tCO2-e/yr)*","If applicable, enhanced Removals from afforestation/reforestation (AR) (tCO2-e/yr)","If applicable, enhanced Removals from other activities besides A/R (tCO2-e/yr)","Net Emissions and Removals (tCO2-e/yr)"]
[]
[null,{"$f":"IF('Reference Sheet'!$B$43:$B$47=0,\"\",'Reference Sheet'!$B$43:$B$47)","v":""},null,null,null,null,{"$f":"IF(COUNT(C10, D10, E10, F10)=0, \"\", SUM(C10:F10))","v":""}]
[null,"",null,null,null,null,{"$f":"IF(COUNT(C11, D11, E11, F11)=0, \"\", SUM(C11:F11))","v":""}]
[null,"",null,null,null,null,""]
[null,"",null,null,null,null,""]
[null,"",null,null,null,null,""]
[null,"Total",{"$f":"IF(COUNTA($C$10:$C$14)=0, \"\", SUM($C$10:$C$14))","v":""},{"$f":"IF(COUNTA($D$10:$D$14)=0, \"\", SUM($D$10:$D$14))","v":""},{"$f":"IF(COUNTA($E$10:$E$14)=0, \"\", SUM($E$10:$E$14))","v":""},{"$f":"IF(COUNTA($F$10:$F$14)=0, \"\", SUM($F$10:$F$14))","v":""},""]
{"$rows_left_out":16}
{"sheet":"Section 4.3","index":4,"n_rows":55,"n_cols":55,"rows_kept":55,"cut":false,"hidden":false,"merged":[[43,42,45,44],[24,35,24,39],[25,48,25,49],[27,50,30,54],[13,48,13,49],[15,50,18,54],[18,36,19,36],[18,37,19,37],[18,38,19,38],[18,39,19,39],[18,40,19,40],[16,40,17,40],[12,42,12,46],[33,42,35,43],[33,37,34,37],[33,38,34,38],[33,39,34,39],[12,40,13,40],[14,40,15,40],[12,35,12,39],[24,42,24,46],[33,36,34,36],[1,1,2,7],[9,1,10,3],[21,1,22,3],[4,1,4,2],[5,1,7,3],[9,4,10,6],[12,10,12,14],[12,15,12,19],[12,20,12,24],[12,25,12,29],[12,30,12,34],[24,25,24,29],[24,30,24,34],[43,15,48,22],[21,4,22,6],[24,10,24,14],[24,15,24,19],[24,20,24,24],[43,2,43,7],[43,8,43,13],[33,8,33,13],[33,2,33,7],[29,2,29,7],[33,15,37,22]]}
[]
[null,"Section 4.3 - Calculation of Emission Reductions"]
[]
[]
[null,"Select the Applicable Option:",null,"Select Option",{"$f":"IF(D5=\"Select Option\", \"⚠️ Please select a valid Option\", \"\")","v":"⚠️ Please select a valid Option"}]
[null,"Please select the calculation approach for this section using the dropdown menu:\n- Option 1: The Reporting Period fully coincides with the Monitoring Period.\n- Option 2: The Reporting Period is shorter than the Monitoring Period and requires pro-rata allocation.\nNote: \n1. Only one option can be used. The table for the other option will be hidden automatically based on your selection. \n2. This calculation approach is only relevant for the first Reporting Period. In subsequent Reporting Periods, the Reporting and Monitoring Periods are expected to be the same, and Option 1 will typically apply."]
[]
[]
[]
[null,"Option 1 (Calculated and Truncated Automatically)",null,null,"1. The Reporting Period coincides with the Monitoring Period.\n2. These tables, calculated and truncated automatically, must be used in the ER-MR."]
[]
[]
[null,null,null,null,null,null,null,null,null,"T.2","Deforestation",null,null,null,null,"If applicable, forest degradation",null,null,null,null,"If applicable, enhanced Removals from afforestation/ reforestation (A/R)",null,null,null,null,"If applicable, enhanced Removals from other activities besides A/R",null,null,null,null,"Adjustment, if applicable",null,null,null,null,"Total (tCO2-e)",null,null,null,null,null,"T.5","Emission Reductions during the Reporting Period (tCO2-e)",null,null,null,null,null,"T.6 ","Year ",{"$f":"TRANSPOSE(IF('Reference Sheet'!$B$43:$B$47=0,\"\",'Reference Sheet'!$B$43:$B$47))","v":""},"","","",""]
[null,"T.1","Deforestation","If applicable, forest degradation","If applicable, enhanced Removals from afforestation/ reforestation (A/R)","If applicable, enhanced Removals from other activities besides A/R*","Adjustment, if applicable","Total (tCO2-e)",null,"Year",{"$f":"TRANSPOSE(IF('Reference Sheet'!$B$43:$B$47=0,\"\",'Reference Sheet'!$B$43:$B$47))","v":""},"","","","",{"$f":"TRANSPOSE(IF('Reference Sheet'!$B$43:$B$47=0,\"\",'Reference Sheet'!$B$43:$B$47))","v":""},"","","","",{"$f":"TRANSPOSE(IF('Reference Sheet'!$B$43:$B$47=0,\"\",'Reference Sheet'!$B$43:$B$47))","v":""},"","","","",{"$f":"TRANSPOSE(IF('Reference Sheet'!$B$43:$B$47=0,\"\",'Reference Sheet'!$B$43:$B$47))","v":""},"","","","",{"$f":"TRANSPOSE(IF('Reference Sheet'!$B$43:$B$47=0,\"\",'Reference Sheet'!$B$43:$B$47))","v":""},"","","","",{"$f":"TRANSPOSE(IF('Reference Sheet'!$B$43:$B$47=0,\"\",'Reference Sheet'!$B$43:$B$47))","v":""},"","","","",null,"Year ",{"$f":"TRANSPOSE(IF('Reference Sheet'!$B$43:$B$47=0,\"\",'Reference Sheet'!$B$43:$B$47))","v":""},"","","","",null,"Emission Reductions from enhanced Removals from afforestation/reforestation as a percentage of the total FCPF ERs (%) ",null,{"$f":"IF(AY13=\"\",\"\",IF('Section 4.3'!$D$5=\"Option 1\",IF(OR('Section 4.3'!C17<0,'Section 4.3'!D17<0),0,'Section 4.3'!AQ16),\"\"))","v":""},{"$f":"IF(AZ13=\"\",\"\",IF('Section 4.3'!$D$5=\"Option 1\",IF(OR('Section 4.3'!C17<0,'Section 4.3'!D17<0),0,'Section 4.3'!AR16),\"\"))","v":""},{"$f":"IF(BA13=\"\",\"\",IF('Section 4.3'!$D$5=\"Option 1\",IF(OR('Section 4.3'!C17<0,'Section 4.3'!D17<0),0,'Section 4.3'!AS16),\"\"))","v":""},{"$f":"IF(BB13=\"\",\"\",IF('Section 4.3'!$D$5=\"Option 1\",IF(OR('Section 4.3'!C17<0,'Section 4.3'!D17<0),0,'Section 4.3'!AT16),\"\"))","v":""},{"$f":"IF(BC13=\"\",\"\",IF('Section 4.3'!$D$5=\"Option 1\",IF(OR('Section 4.3'!C17<0,'Section 4.3'!D17<0),0,'Section 4.3'!AU16),\"\"))","v":""}]
[null,"Emissions or Removals in the Reference Level (tCO2-e)",{"$f":"'Section 4.1'!$C$27","v":""},{"$f":"'Section 4.1'!$D$27","v":""},{"$f":"'Section 4.1'!$E$27","v":""},{"$f":"'Section 4.1'!$F$27","v":""},{"$f":"SUM(AE15:AI15)","v":0},{"$f":"'Section 4.1'!$H$27","v":""},null,"Emissions or Removals in the Reference Level (tCO2-e)",{"$f":"TRANSPOSE(IF(ISBLANK('Section 4.1'!$C$22:$C$26),\"\",'Section 4.1'!$C$22:$C$26))","v":""},"","","","",{"$f":"TRANSPOSE(IF(ISBLANK('Section 4.1'!$D$22:$D$26),\"\",'Section 4.1'!$D$22:$D$26))","v":""},"","","","",{"$f":"TRANSPOSE(IF(ISBLANK('Section 4.1'!$E$22:$E$26),\"\",'Section 4.1'!$E$22:$E$26))","v":""},"","","","",{"$f":"TRANSPOSE(IF(ISBLANK('Section 4.1'!$F$22:$F$26),\"\",'Section 4.1'!$F$22:$F$26))","v":""},"","","","",{"$f":"TRANSPOSE(IF(ISBLANK('Section 4.1'!$G$22:$G$26),\"\",'Section 4.1'!$G$22:$G$26))","v":""},"","","","",{"$f":"IF(COUNT(K15, P15, U15, Z15, AE15)=0, \"\", SUM(K15, P15, U15, Z15, AE15))","v":""},{"$f":"IF(COUNT(L15, Q15, V15, AA15, AF15)=0, \"\", SUM(L15, Q15, V15, AA15, AF15))","v":""},{"$f":"IF(COUNT(M15, R15, W15, AB15, AG15)=0, \"\", SUM(M15, R15, W15, AB15, AG15))","v":""},{"$f":"IF(COUNT(N15, S15, X15, AC15, AH15)=0, \"\", SUM(N15, S15, X15, AC15, AH15))","v":""},{"$f":"IF(COUNT(O15, T15, Y15, AD15, AI15)=0, \"\", SUM(O15, T15, Y15, AD15, AI15))","v":""},null,"Total ",{"$f":"IF(COUNT(K17, P17, U17, Z17, AE17)=0, \"\", SUM(K17, P17, U17, Z17, AE17))","v":""},{"$f":"IF(COUNT(L17, Q17, V17, AA17, AF17)=0, \"\", SUM(L17, Q17, V17, AA17, AF17))","v":""},{"$f":"IF(COUNT(M17, R17, W17, AB17, AG17)=0, \"\", SUM(M17, R17, W17, AB17, AG17))","v":""},{"$f":"IF(COUNT(N17, S17, X17, AC17, AH17)=0, \"\", SUM(N17, S17, X17, AC17, AH17))","v":""},{"$f":"IF(COUNT(O17, T17, Y17, AD17, AI17)=0, \"\", SUM(O17, T17, Y17, AD17, AI17))","v":""}]
{"$rows_left_out":41}
{"sheet":"Section 7.2","index":5,"n_rows":41,"n_cols":10,"rows_kept":41,"cut":false,"hidden":false,"merged":[[1,9,5,13],[1,1,2,6],[29,4,30,4],[29,5,30,5],[29,6,30,6],[4,1,4,6],[5,1,5,6],[20,1,21,1],[20,2,21,2],[20,3,21,3],[20,4,21,4],[20,5,21,5],[20,6,21,6],[32,3,33,3],[34,3,35,3],[36,3,37,3],[29,2,30,2],[27,1,27,3],[29,1,30,1],[29,3,30,3]]}
[]
[null,"Section 7.2 - Quantification of Reversals during the Reporting Period\nAlways Copy and Paste using Match Destination Formatting or Paste Values",null,null,null,null,null,null,null,"Note:\n\nThis section is optional and should only be completed if the ER Program is reporting reversal events for the current Reporting Period.\n\nIf no reversal events occurred, leave this section blank."]
[]
[]
[null,"Using the table below, please confirm and quantify any Reversals of ERs that might have occurred during the Reporting Period. "]
[null,"Refer to indicator 19.1 of the Methodological Framework and the FCPF ER Program Buffer Guidelines."]
[]
[]
[null,"A.","ER Program Reference level for this Reporting Period (tCO2-e)","from section 4.1",null,{"$f":"'Section 4.1'!$H$27","v":""}]
[]
[null,"B.","ER Program Reference level for all previous Reporting Periods in the ERPA (tCO2-e).","from section 4.1 of previous ER Monitoring Reports",null,null,"+",null,"Please enter this value manually, if applicable"]
[]
[null,"C.","Cumulative Reference Level Emissions for all Reporting Periods [A + B]",null,null,{"$f":"IF(COUNT(F9, F11)=0, \"\", IFERROR(F9+F11, 0))","v":""}]
[]
[null,"D.","Estimation of Emissions by Sources and Removals by Sinks for this Reporting Period (tCO2-e) ","from section 4.2",null,{"$f":"'Section 4.2'!$G$29","v":""}]
{"$rows_left_out":27}
{"sheet":"Section 7.3","index":6,"n_rows":43,"n_cols":10,"rows_kept":43,"cut":false,"hidden":false,"merged":[[4,1,4,6],[5,1,5,6],[32,1,32,6],[1,1,2,6],[1,9,5,13]]}
[]
[null,"Section 7.3 - Quantification of ooled reversal buffer replenishments \nAlways Copy and Paste using Match Destination Formatting or Paste Values",null,null,null,null,null,null,null,"Note:\n\nThis section is optional and should only be completed if the ER Program has to quantify the amount of Pooled Reversal Buffer replenishments for the current Reporting Period.\n\nIf no reversal events occurred, leave this section blank."]
[]
[]
[null,"Using the table below, please confirm and quantify the amount of Pooled Reversal Buffer replenishments applicable in the current Reporting Period."]
[null,"Refer to Indicator 19 of the Methodological Framework and the FCPF ER Program Buffer Guidelines."]
[]
[]
[null,"A.","Emission Reductions during the Reporting period (tCO2-e)","from section 4.3",null,{"$f":"IF('Section 4.3'!$D$5=\"Option 1\",'Section 4.3'!H17,IF('Section 4.3'!$D$5=\"Option 2\",'Section 4.3'!H31,\"\"))","v":""}]
[]
[null,"B.","If applicable, number of Emission Reductions from reducing forest degradation that have been estimated using proxy-based estimation approaches (use zero if not applicable)",null,null,null,null,null,"Please enter this value manually, if applicable"]
[]
[null,"C.","Number of Emission Reductions estimated using measurement approaches (A-B)",null,null,{"$f":"IF(COUNT(F9, F11)=0, \"\", IFERROR(F9-F11, 0))","v":""}]
[]
[null,"D.","Percentage of ERs (A) for which the ability to transfer Title to ERs is clear or uncontested ","from section 6.1",null,null,null,null,"Please enter this value manually, if applicable"]
{"$rows_left_out":29}
{"sheet":"Section 8","index":7,"n_rows":38,"n_cols":12,"rows_kept":38,"cut":false,"hidden":false,"merged":[[31,11,33,14],[28,1,28,9],[30,1,30,9],[4,1,4,4],[18,1,18,9],[20,1,20,9],[22,1,22,9],[24,1,24,9],[26,1,26,9],[8,2,8,9],[10,1,10,9],[12,1,12,9],[14,1,14,9],[16,1,16,9],[6,1,6,3],[34,1,34,9],[36,1,36,9],[1,1,2,7]]}
[]
[null,"Section 8 - Emission Reductions available for transfer to the Carbon Fund\nAlways Copy and Paste using Match Destination Formatting or Paste Values"]
[]
[]
[null,"Quantify the emission reductions available for transfer to the Carbon Fund by completing the white cells in the table below. Additional columns may be added if the country wishes to report in separate calendar years. If it does not wish to report per calendar years, the FCPF units will be distributed per calendar years pro-rata to the number of years at the time of issuance. Separation in calendar years is only applicable if the Emission Reductions in all the years of the Reporting Period are positive."]
[]
[null,"Year",null,null,{"$f":"TRANSPOSE(IF('Reference Sheet'!$B$43:$B$47=0,\"\",'Reference Sheet'!$B$43:$B$47))","v":""},"","","","","TOTAL"]
[null,"A.","Emission Reductions during the Reporting period (tCO2-e)","from section 4.3",{"$f":"IF('Section 4.3'!$D$5=\"Option 1\",'Section 4.3'!AQ15,IF('Section 4.3'!$D$5=\"Option 2\",'Section 4.3'!AQ27,\"\"))","v":""},{"$f":"IF('Section 4.3'!$D$5=\"Option 1\",'Section 4.3'!AR15,IF('Section 4.3'!$D$5=\"Option 2\",'Section 4.3'!AR27,\"\"))","v":""},{"$f":"IF('Section 4.3'!$D$5=\"Option 1\",'Section 4.3'!AS15,IF('Section 4.3'!$D$5=\"Option 2\",'Section 4.3'!AS27,\"\"))","v":""},{"$f":"IF('Section 4.3'!$D$5=\"Option 1\",'Section 4.3'!AT15,IF('Section 4.3'!$D$5=\"Option 2\",'Section 4.3'!AT27,\"\"))","v":""},{"$f":"IF('Section 4.3'!$D$5=\"Option 1\",'Section 4.3'!AU15,IF('Section 4.3'!$D$5=\"Option 2\",'Section 4.3'!AU27,\"\"))","v":""},{"$f":"SUM(E8:I8)","v":0}]
[]
[null,"B. ","If applicable, number of Emission Reductions from reducing forest degradation that have been estimated using proxy-based estimation approaches (use zero if not applicable)",null,null,null,null,null,null,{"$f":"SUM(E10:I10)","v":0},null,"Please enter this value manually, if applicable"]
[]
[null,"C.","Number of Emission Reductions estimated using measurement approaches (A-B)",null,{"$f":"IF(OR(ISNUMBER(E8), ISNUMBER(E10)), E8-E10, \"\")","v":""},{"$f":"IF(OR(ISNUMBER(F8), ISNUMBER(F10)), F8-F10, \"\")","v":""},"","","",{"$f":"SUM(E12:I12)","v":0}]
[]
[null,"D.","Percentage of ERs (A) for which the ability to transfer Title to ERs is clear or uncontested","from section 6.1",null,null,null,null,null,null,null,"Please enter this value manually"]
[]
{"$rows_left_out":24}
{"sheet":"Annex 4 Section 8.4","index":8,"n_rows":34,"n_cols":9,"rows_kept":34,"cut":false,"hidden":false,"merged":[[1,1,2,7],[10,1,11,3],[10,4,11,6],[23,1,24,3],[23,4,24,6],[4,1,4,2],[4,5,8,7],[5,1,8,2]]}
[]
[null,"Annex 4 Section 8.4 - Estimated Reference Level"]
[]
[]
[null,"Select the Applicable Option:",null,"Select Option",{"$f":"IF(D5=\"Select Option\", \"⚠️ Please select a valid Option\", \"\")","v":"⚠️ Please select a valid Option"},"INSTRUCTIONS\n\nImportant: This worksheet is only applicable for the First ER-Monitoring Report under the ERPA.\n\nIf this is the second or subsequent Monitoring Report, do not truncate these values. Instead, you must copy exactly the official figures published in the first ER-Monitoring Report documentation (Word/PDF), to ensure consistency and traceability.\n"]
[null,"Please select the calculation approach for this section using the dropdown menu:\n- Option 1: This is the first ER-Monitoring Report under the ERPA. \n- Option 2: This is the second or subsequent ER-Monitoring Report under the ERPA. \nNote: Only one option can be used. The table for the other option will be hidden automatically based on your selection."]
[]
[]
[]
[]
[null," Input Data (With Decimals)\nAlways Copy and Paste using Match Destination Formatting or Paste Values",null,null,"1. Copy and paste the original values here with all decimals, as reported in the ER Program’s own calculation spreadsheet (i.e. the national spreadsheet developed by the ER Program). Fill out the cells highlighted in red.\nIf a value is not applicable, enter “0” instead of leaving the cell blank.\nOnce filled, red cells will turn blue to indicate that they remain editable (as opposed to white, which are locked).\n2. Do not manually truncate, please."]
[]
[]
[null,"Year of Monitoring / Reporting Period t ","Average annual historical Emissions from deforestation over the Reference Period (tCO2-e/yr)","If applicable, average annual historical Emissions from forest degradation over the Reference Period (tCO2-e/yr)","If applicable, average annual historical enhanced Removals from afforestation/reforestation (A/R) (tCO2-e/yr)","If applicable, average annual historical enhanced Removals from other activities besides A/R (tCO2-e/yr)","Adjustment, if applicable (tCO2-e/yr)","Reference Level (tCO2-e/yr)"]
[null,{"$f":"IF('Reference Sheet'!$B$43:$B$47=0,\"\",'Reference Sheet'!$B$43:$B$47)","v":""},null,null,null,null,null,{"$f":"IF(COUNT($C15, $D15, $E15, $F15, $G15)=0, \"\", SUM($C15:$G15))","v":""}]
{"$rows_left_out":20}
{"sheet":"Support sheet (hidden)","index":9,"n_rows":17,"n_cols":6,"rows_kept":17,"cut":false,"hidden":true,"merged":[[1,1,2,6]]}
[]
[null,"SUPPORT SHEET"]
[]
[]
[null,"Years of Monitoring",null,"Section 4.3 Options",null,"Dates"]
[null,null,null,"Select Option",null,"2015-01-01"]
[null,2015,null,"Option 1",null,"2029-12-31"]
[null,2016,null,"Option 2"]
[null,2017]
[null,2018]
[null,2019]
[null,2020]
[null,2021]
[null,2022]
[null,2023]
{"$rows_left_out":2}